encapsulate-v
type: LexicalEntry
canonical form: encapsulate
sense: 00245302-v
part of speech: verb
sense: 01590905-v

capsule-v
type: LexicalEntry
canonical form: capsule
sense: 00245302-v
part of speech: verb

capsulize-v
type: LexicalEntry
canonical form: capsulize
sense: 00245302-v
part of speech: verb

capsulise-v
type: LexicalEntry
canonical form: capsulise
sense: 00245302-v
part of speech: verb

00245302-v
type: LexicalConcept
in scheme: en-word.net
definition: put in a short or concise form; reduce in volume
example: capsulize the news
ili: i22939
lexfile: verb.change
part of speech: verb
hypernym: 00245511-v

01590905-v
type: LexicalConcept
in scheme: en-word.net
definition: enclose in a capsule or other small container
ili: i29669
lexfile: verb.contact
part of speech: verb
hypernym: 01589983-v