enamel-v
type: LexicalEntry
canonical form: enamel
sense: 01685618-v
part of speech: verb

01685618-v
type: LexicalConcept
in scheme: en-word.net
definition: coat, inlay, or surface with enamel
ili: i30155
lexfile: verb.creation
part of speech: verb
domain topic: 00716196-n
entails: 00321337-v
hypernym: 01679858-v

enamel-n
type: LexicalEntry
canonical form: enamel
sense: 03289654-n
part of speech: noun
sense: 03289797-n
sense: 05316180-n
sense: 15135021-n

03289654-n
type: LexicalConcept
in scheme: en-word.net
definition: any smooth glossy coating that resembles ceramic glaze
ili: i53406
lexfile: noun.artifact
part of speech: noun
hypernym: 03062092-n

03289797-n
type: LexicalConcept
in scheme: en-word.net
definition: a paint that dries to a hard glossy finish
ili: i53407
lexfile: noun.artifact
part of speech: noun
hypernym: 03880896-n

tooth enamel-n
type: LexicalEntry
canonical form: tooth enamel
sense: 05316180-n
part of speech: noun

05316180-n
type: LexicalConcept
in scheme: en-word.net
definition: hard white substance covering the crown of a tooth
ili: i64855
lexfile: noun.body
part of speech: noun
hypernym: 05271580-n

15135021-n
type: LexicalConcept
in scheme: en-word.net
definition: a colored glassy compound (opaque or partially opaque) that is fused to the surface of metal or glass or pottery for decoration or protection
ili: i116616
lexfile: noun.substance
part of speech: noun
hypernym: 14842408-n