quackery-n
type: LexicalEntry
canonical form: quackery
sense: 00634351-n
part of speech: noun

empiricism-n
type: LexicalEntry
canonical form: empiricism
sense: 00634351-n
part of speech: noun
sense: 00636942-n
sense: 05979178-n

00634351-n
type: LexicalConcept
in scheme: en-word.net
definition: medical practice and advice based on observation and experience in ignorance of scientific findings
ili: i38754
lexfile: noun.act
part of speech: noun
hypernym: 00633444-n

00636942-n
type: LexicalConcept
in scheme: en-word.net
definition: the application of empirical methods in any art or science
ili: i38766
lexfile: noun.act
part of speech: noun
hypernym: 00635107-n

empiricist philosophy-n
type: LexicalEntry
canonical form: empiricist philosophy
sense: 05979178-n
part of speech: noun

sensationalism-n
type: LexicalEntry
canonical form: sensationalism
sense: 05979178-n
part of speech: noun

05979178-n
type: LexicalConcept
in scheme: en-word.net
definition: (philosophy) the doctrine that knowledge derives from experience
ili: i68202
lexfile: noun.cognition
part of speech: noun
domain topic: 06168062-n
hypernym: 06177044-n