emigrate-v
type: LexicalEntry
canonical form: emigrate
sense: 00417060-v
part of speech: verb

00417060-v
type: LexicalConcept
in scheme: en-word.net
definition: leave one's country of residence for a new one
example: Many people had to emigrate during the Nazi period
ili: i23804
lexfile: verb.change
part of speech: verb
entails: 02013448-v
hypernym: 01860612-v