duel-n
type: LexicalEntry
canonical form: duel
sense: 00790898-n
part of speech: noun
sense: 01175274-n

00790898-n
type: LexicalConcept
in scheme: en-word.net
definition: any struggle between two skillful opponents (individuals or groups)
ili: i39555
lexfile: noun.act
part of speech: noun
hypernym: 00790634-n

duel-v
type: LexicalEntry
canonical form: duel
sense: 01124374-v
part of speech: verb

01124374-v
type: LexicalConcept
in scheme: en-word.net
definition: fight a duel, as over one's honor or a woman
example: In the 19th century, men often dueled over small matters
ili: i27207
lexfile: verb.competition
part of speech: verb
hypernym: 01092746-v

affaire d'honneur-n
type: LexicalEntry
canonical form: affaire d'honneur
sense: 01175274-n
part of speech: noun

01175274-n
type: LexicalConcept
in scheme: en-word.net
definition: a prearranged fight with deadly weapons by two people (accompanied by seconds) in order to settle a quarrel over a point of honor
ili: i41545
lexfile: noun.act
part of speech: noun
hypernym: 01173452-n