distinguishable-a
type: LexicalEntry
canonical form: distinguishable
sense: https://en-word.net/lemma/distinguishable-a#00584665-a
part of speech: adjective
sense: 02074467-s

https://en-word.net/synset/00584665-a
type: LexicalConcept
in scheme: en-word.net
definition: capable of being perceived as different or distinct
example: only the shine of their metal was distinguishable in the gloom
example: a project distinguishable into four stages of progress
example: distinguishable differences between the twins
ili: i3241
lexfile: adj.all
part of speech: adjective
similar: 00584987-s
similar: 00585113-s

distinct-a
type: LexicalEntry
canonical form: distinct
sense: 02074467-s
part of speech: adjective

02074467-s
type: LexicalConcept
in scheme: en-word.net
definition: (often followed by ‘from’) not alike; different in nature or quality
example: plants of several distinct types
example: the word ‘nationalism’ is used in at least two distinct senses
example: gold is distinct from iron
example: a tree related to but quite distinct from the European beech
example: management had interests quite distinct from those of their employees
ili: i11333
lexfile: adj.all
part of speech: adjective satellite
similar: https://en-word.net/synset/02072149-a