distemper-n
type: LexicalEntry
canonical form: distemper
sense: 00938717-n
part of speech: noun
sense: 03217256-n
sense: 03217419-n
sense: 07567553-n
sense: 14287544-n

00938717-n
type: LexicalConcept
in scheme: en-word.net
definition: a method of painting in which the pigments are mixed with water and a binder; used for painting posters or murals or stage scenery
ili: i40325
lexfile: noun.act
part of speech: noun
hypernym: 00938436-n

distemper-v
type: LexicalEntry
canonical form: distemper
sense: 01687317-v
part of speech: verb

01687317-v
type: LexicalConcept
in scheme: en-word.net
definition: paint with distemper
ili: i30165
lexfile: verb.creation
part of speech: verb
domain topic: 00935235-n
hypernym: 01688794-v

03217256-n
type: LexicalConcept
in scheme: en-word.net
definition: a painting created with paint that is made by mixing the pigments with water and a binder
ili: i52993
lexfile: noun.artifact
part of speech: noun
hypernym: 03882197-n

03217419-n
type: LexicalConcept
in scheme: en-word.net
definition: paint made by mixing the pigments with water and a binder
ili: i52994
lexfile: noun.artifact
part of speech: noun
hypernym: 03880896-n

ill humor-n
type: LexicalEntry
canonical form: ill humor
sense: 07567553-n
part of speech: noun

ill humour-n
type: LexicalEntry
canonical form: ill humour
sense: 07567553-n
part of speech: noun

07567553-n
type: LexicalConcept
in scheme: en-word.net
definition: an angry and disagreeable mood
ili: i76448
lexfile: noun.feeling
part of speech: noun
hypernym: 07566518-n

14287544-n
type: LexicalConcept
in scheme: en-word.net
definition: any of various infectious viral diseases of animals
ili: i111892
lexfile: noun.state
part of speech: noun
hypernym: 14276606-n