unburden-v
type: LexicalEntry
canonical form: unburden
sense: 01490553-v
part of speech: verb

disburden-v
type: LexicalEntry
canonical form: disburden
sense: 01490553-v
part of speech: verb

01490553-v
type: LexicalConcept
in scheme: en-word.net
definition: take the burden off; remove the burden from
example: unburden the donkey
ili: i29160
lexfile: verb.contact
part of speech: verb
hypernym: 00173351-v