devein-v
type: LexicalEntry
canonical form: devein
sense: 02370480-v
part of speech: verb

02370480-v
type: LexicalConcept
in scheme: en-word.net
definition: remove the dark dorsal vein of (a shrimp)
ili: i33590
lexfile: verb.possession
part of speech: verb
hypernym: 02228837-v