devaluation-n
type: LexicalEntry
canonical form: devaluation
sense: 00354818-n
part of speech: noun
sense: 00807185-n

00354818-n
type: LexicalConcept
in scheme: en-word.net
definition: the reduction of something's value or worth
ili: i37271
lexfile: noun.act
part of speech: noun
hypernym: 00352464-n

00807185-n
type: LexicalConcept
in scheme: en-word.net
definition: an official lowering of a nation's currency; a decrease in the value of a country's currency relative to that of foreign countries
ili: i39637
lexfile: noun.act
part of speech: noun
hypernym: 00806695-n