depreciate-v
type: LexicalEntry
canonical form: depreciate
sense: 00315821-v
part of speech: verb

undervalue-v
type: LexicalEntry
canonical form: undervalue
sense: 00315821-v
part of speech: verb

devaluate-v
type: LexicalEntry
canonical form: devaluate
sense: 00315821-v
part of speech: verb
sense: 00494865-v

devalue-v
type: LexicalEntry
canonical form: devalue
sense: 00315821-v
part of speech: verb
sense: 00494865-v

00315821-v
type: LexicalConcept
in scheme: en-word.net
definition: lose in value
example: The dollar depreciated again
ili: i23304
lexfile: verb.change
part of speech: verb
hypernym: 00151509-v
similar: 00316131-v

00494865-v
type: LexicalConcept
in scheme: en-word.net
definition: remove the value from; deprive of its value
ili: i24178
lexfile: verb.change
part of speech: verb
hypernym: 00208136-v