democratize-v
type: LexicalEntry
canonical form: democratize
sense: 02539414-v
part of speech: verb
sense: 02539573-v

democratise-v
type: LexicalEntry
canonical form: democratise
sense: 02539414-v
part of speech: verb
sense: 02539573-v

02539414-v
type: LexicalConcept
in scheme: en-word.net
definition: introduce democratic reforms; of nations
ili: i34370
lexfile: verb.social
part of speech: verb
hypernym: 00126072-v

02539573-v
type: LexicalConcept
in scheme: en-word.net
definition: become (more) democratic; of nations
ili: i34371
lexfile: verb.social
part of speech: verb
hypernym: 00109468-v