disarm-v
type: LexicalEntry
canonical form: disarm
sense: 01090246-v
part of speech: verb

demilitarize-v
type: LexicalEntry
canonical form: demilitarize
sense: 01090246-v
part of speech: verb
sense: 01101801-v

demilitarise-v
type: LexicalEntry
canonical form: demilitarise
sense: 01090246-v
part of speech: verb
sense: 01101801-v

01090246-v
type: LexicalConcept
in scheme: en-word.net
definition: remove offensive capability from
ili: i27032
lexfile: verb.competition
part of speech: verb
hypernym: 00572138-v

01101801-v
type: LexicalConcept
in scheme: en-word.net
definition: do away with the military organization and potential of
ili: i27088
lexfile: verb.competition
part of speech: verb
hypernym: 01090416-v