dried-a
type: LexicalEntry
canonical form: dried
sense: 01076070-s
part of speech: adjective

dehydrated-a
type: LexicalEntry
canonical form: dehydrated
sense: 01076070-s
part of speech: adjective
sense: 01179601-s

desiccated-a
type: LexicalEntry
canonical form: desiccated
sense: 01076070-s
part of speech: adjective

01076070-s
type: LexicalConcept
in scheme: en-word.net
definition: preserved by removing natural moisture
example: dried beef
example: dried fruit
example: dehydrated eggs
example: shredded and desiccated coconut meat
ili: i5882
lexfile: adj.all
part of speech: adjective satellite
similar: https://en-word.net/synset/01075111-a

01179601-s
type: LexicalConcept
in scheme: en-word.net
definition: suffering from excessive loss of water from the body
example: fever resulted from becoming dehydrated
example: was dehydrated after the marathon
ili: i6428
lexfile: adj.all
part of speech: adjective satellite
similar: https://en-word.net/synset/01176433-a