cuisine-n
type: LexicalEntry
canonical form: cuisine
sense: 07586889-n
part of speech: noun

culinary art-n
type: LexicalEntry
canonical form: culinary art
sense: 07586889-n
part of speech: noun

07586889-n
type: LexicalConcept
in scheme: en-word.net
definition: the practice or manner of preparing food or the food so prepared
ili: i76543
lexfile: noun.food
part of speech: noun
hypernym: 00244785-n