crayon-v
type: LexicalEntry
canonical form: crayon
sense: 01696604-v
part of speech: verb

01696604-v
type: LexicalConcept
in scheme: en-word.net
definition: write, draw, or trace with a crayon
ili: i30207
lexfile: verb.creation
part of speech: verb
hypernym: 01694189-v

crayon-n
type: LexicalEntry
canonical form: crayon
sense: 03132899-n
part of speech: noun

wax crayon-n
type: LexicalEntry
canonical form: wax crayon
sense: 03132899-n
part of speech: noun

03132899-n
type: LexicalConcept
in scheme: en-word.net
definition: writing implement consisting of a colored stick of composition wax used for writing and drawing
ili: i52481
lexfile: noun.artifact
part of speech: noun
hypernym: 04615925-n