cox-v
type: LexicalEntry
canonical form: cox
sense: 02451998-v
part of speech: verb

02451998-v
type: LexicalConcept
in scheme: en-word.net
definition: act as the coxswain, in a boat race
ili: i33959
lexfile: verb.social
part of speech: verb
hypernym: 02450790-v

coxswain-n
type: LexicalEntry
canonical form: coxswain
sense: 09993154-n
part of speech: noun

cox-n
type: LexicalEntry
canonical form: cox
sense: 09993154-n
part of speech: noun

09993154-n
type: LexicalConcept
in scheme: en-word.net
definition: the helmsman of a ship's boat or a racing crew
ili: i89286
lexfile: noun.person
part of speech: noun
hypernym: 10189389-n