overawe-v
type: LexicalEntry
canonical form: overawe
sense: 01783720-v
part of speech: verb

cow-v
type: LexicalEntry
canonical form: cow
sense: 01783720-v
part of speech: verb

01783720-v
type: LexicalConcept
in scheme: en-word.net
definition: subdue, restrain, or overcome by affecting with a feeling of awe; frighten (as with threats)
ili: i30632
lexfile: verb.emotion
part of speech: verb
hypernym: 01783561-v

cow-n
type: LexicalEntry
canonical form: cow
sense: 01890428-n
part of speech: noun
sense: 02406106-n
sense: 09992117-n

01890428-n
type: LexicalConcept
in scheme: en-word.net
definition: mature female of mammals of which the male is called ‘bull’
ili: i45233
lexfile: noun.animal
part of speech: noun
hypernym: 01889397-n

moo-cow-n
type: LexicalEntry
canonical form: moo-cow
sense: 02406106-n
part of speech: noun

02406106-n
type: LexicalConcept
in scheme: en-word.net
definition: female of domestic cattle:
ili: i48238
lexfile: noun.animal
part of speech: noun
hypernym: 02405077-n
mero part: 02373012-n
mero part: 05546645-n

09992117-n
type: LexicalConcept
in scheme: en-word.net
definition: a large unpleasant woman
ili: i89279
lexfile: noun.person
part of speech: noun
exemplifies: 06730109-n
hypernym: 09654651-n