costume-v
type: LexicalEntry
canonical form: costume
sense: 00051478-v
part of speech: verb
sense: 02342541-v

dress up-v
type: LexicalEntry
canonical form: dress up
sense: 00051478-v
part of speech: verb

00051478-v
type: LexicalConcept
in scheme: en-word.net
definition: dress in a costume
example: We dressed up for Halloween as pumpkins
ili: i22030
lexfile: verb.body
part of speech: verb
hypernym: 00047662-v
similar: 00043880-v

02342541-v
type: LexicalConcept
in scheme: en-word.net
definition: furnish with costumes; as for a film or play
ili: i33425
lexfile: verb.possession
part of speech: verb
domain topic: 06167042-n
hypernym: 02332196-v

costume-n
type: LexicalEntry
canonical form: costume
sense: 03118308-n
part of speech: noun
sense: 03118486-n
sense: 03118692-n
sense: 03118887-n

03118308-n
type: LexicalConcept
in scheme: en-word.net
definition: the attire worn in a play or at a fancy dress ball
example: he won the prize for best costume
ili: i52396
lexfile: noun.artifact
part of speech: noun
hypernym: 02759103-n
mero part: 04557832-n

03118486-n
type: LexicalConcept
in scheme: en-word.net
definition: the attire characteristic of a country or a time or a social class
example: he wore his national costume
ili: i52397
lexfile: noun.artifact
part of speech: noun
hypernym: 02759103-n

03118692-n
type: LexicalConcept
in scheme: en-word.net
definition: unusual or period attire not characteristic of or appropriate to the time and place
example: in spite of the heat he insisted on his woolen costume
ili: i52398
lexfile: noun.artifact
part of speech: noun
hypernym: 02759103-n

03118887-n
type: LexicalConcept
in scheme: en-word.net
definition: the prevalent fashion of dress (including accessories and hair style as well as garments)
ili: i52399
lexfile: noun.artifact
part of speech: noun
hypernym: 02759103-n