cortege-n
type: LexicalEntry
canonical form: cortege
sense: 08446124-n
part of speech: noun
sense: 08446439-n

retinue-n
type: LexicalEntry
canonical form: retinue
sense: 08446124-n
part of speech: noun

suite-n
type: LexicalEntry
canonical form: suite
sense: 08446124-n
part of speech: noun

entourage-n
type: LexicalEntry
canonical form: entourage
sense: 08446124-n
part of speech: noun

08446124-n
type: LexicalConcept
in scheme: en-word.net
definition: the group following and attending to some important person
ili: i81413
lexfile: noun.group
part of speech: noun
hypernym: 07991473-n
mero part: 08232722-n

08446439-n
type: LexicalConcept
in scheme: en-word.net
definition: a funeral procession
ili: i81415
lexfile: noun.group
part of speech: noun
hypernym: 00297411-n