copyright-v
type: LexicalEntry
canonical form: copyright
sense: 02244315-v
part of speech: verb

02244315-v
type: LexicalConcept
in scheme: en-word.net
definition: secure a copyright on a written work
example: did you copyright your manuscript?
ili: i32937
lexfile: verb.possession
part of speech: verb
hypernym: 02243552-v

copyright-n
type: LexicalEntry
canonical form: copyright
sense: 06484839-n
part of speech: noun

right of first publication-n
type: LexicalEntry
canonical form: right of first publication
sense: 06484839-n
part of speech: noun

06484839-n
type: LexicalConcept
in scheme: en-word.net
definition: a document granting exclusive right to publish and sell literary or musical or artistic work
ili: i70473
lexfile: noun.communication
part of speech: noun
hypernym: 06481744-n
hypernym: 05184812-n