constitutionalize-v
type: LexicalEntry
canonical form: constitutionalize
sense: 00569738-v
part of speech: verb
sense: 01886472-v
sense: 02358197-v

constitutionalise-v
type: LexicalEntry
canonical form: constitutionalise
sense: 00569738-v
part of speech: verb

00569738-v
type: LexicalConcept
in scheme: en-word.net
definition: incorporate into a constitution, make constitutional
example: A woman's right to an abortion was constitutionalized in the 1970's
ili: i24590
lexfile: verb.change
part of speech: verb
hypernym: 00126072-v

01886472-v
type: LexicalConcept
in scheme: en-word.net
definition: take a walk for one's health or to aid digestion, as after a meal
example: A good way of exercising is to constitutionalize
ili: i31117
lexfile: verb.motion
part of speech: verb
hypernym: 01886163-v

02358197-v
type: LexicalConcept
in scheme: en-word.net
definition: provide with a constitution, as of a country
example: The United States were constitutionalized in the late 18th century
ili: i33511
lexfile: verb.possession
part of speech: verb
hypernym: 02332196-v