condensation-n
type: LexicalEntry
canonical form: condensation
sense: 11466338-n
part of speech: noun

condensate-n
type: LexicalEntry
canonical form: condensate
sense: 11466338-n
part of speech: noun
sense: 15033332-n

11466338-n
type: LexicalConcept
in scheme: en-word.net
definition: atmospheric moisture that has condensed because of cold
ili: i97741
lexfile: noun.phenomenon
part of speech: noun
hypernym: 11445694-n

15033332-n
type: LexicalConcept
in scheme: en-word.net
definition: a product of condensation
ili: i116027
lexfile: noun.substance
part of speech: noun
hypernym: 15033893-n