virus-n
type: LexicalEntry
canonical form: virus
sense: 06597992-n
part of speech: noun

computer virus-n
type: LexicalEntry
canonical form: computer virus
sense: 06597992-n
part of speech: noun

06597992-n
type: LexicalConcept
in scheme: en-word.net
definition: a software program capable of reproducing itself and usually capable of causing great harm to files or other programs on the same computer
example: a true virus cannot spread to another computer without human assistance
ili: i71066
lexfile: noun.communication
part of speech: noun
hypernym: 06585196-n