collector-n
type: LexicalEntry
canonical form: collector
sense: 03073385-n
part of speech: noun
sense: 09272061-n
sense: 09955820-n
sense: 09956078-n

03073385-n
type: LexicalConcept
in scheme: en-word.net
definition: the electrode in a transistor through which a primary flow of carriers leaves the region between the electrodes
ili: i52164
lexfile: noun.artifact
part of speech: noun
hypernym: 03279707-n

09272061-n
type: LexicalConcept
in scheme: en-word.net
definition: a crater that has collected cosmic material hitting the earth
ili: i85236
lexfile: noun.object
part of speech: noun
hypernym: 09282125-n

gatherer-n
type: LexicalEntry
canonical form: gatherer
sense: 09955820-n
part of speech: noun

accumulator-n
type: LexicalEntry
canonical form: accumulator
sense: 09955820-n
part of speech: noun

09955820-n
type: LexicalConcept
in scheme: en-word.net
definition: a person who is employed to collect payments (as for rent or taxes)
ili: i89073
lexfile: noun.person
part of speech: noun
domain topic: 13330021-n
hypernym: 09655706-n

aggregator-n
type: LexicalEntry
canonical form: aggregator
sense: 09956078-n
part of speech: noun

09956078-n
type: LexicalConcept
in scheme: en-word.net
definition: a person who collects things
ili: i89074
lexfile: noun.person
part of speech: noun
hypernym: 09786620-n