wagon-n
type: LexicalEntry
canonical form: wagon
sense: 04550795-n
part of speech: noun

coaster wagon-n
type: LexicalEntry
canonical form: coaster wagon
sense: 04550795-n
part of speech: noun

04550795-n
type: LexicalConcept
in scheme: en-word.net
definition: a child's four-wheeled toy cart sometimes used for coasting
ili: i60908
lexfile: noun.artifact
part of speech: noun
hypernym: 04583497-n