city-n
type: LexicalEntry
canonical form: city
sense: 08243256-n
part of speech: noun
sense: 08542298-n
sense: 08558466-n

metropolis-n
type: LexicalEntry
canonical form: metropolis
sense: 08243256-n
part of speech: noun
sense: 08542298-n

08243256-n
type: LexicalConcept
in scheme: en-word.net
definition: people living in a large densely populated municipality
example: the city voted for Republicans in 1994
ili: i80341
lexfile: noun.group
part of speech: noun
hypernym: 08242502-n

urban center-n
type: LexicalEntry
canonical form: urban center
sense: 08542298-n
part of speech: noun

08542298-n
type: LexicalConcept
in scheme: en-word.net
definition: a large and densely populated urban area; may include several independent administrative districts
example: Ancient Troy was a great city
ili: i81847
lexfile: noun.location
part of speech: noun
hypernym: 08643858-n
mero part: 08526272-n
mero part: 08541617-n
mero part: 08560644-n
mero part: 08561059-n
mero part: 08561188-n
mero part: 08588686-n

08558466-n
type: LexicalConcept
in scheme: en-word.net
definition: an incorporated administrative district established by state charter
example: the city raised the tax rate
ili: i81866
lexfile: noun.location
part of speech: noun
hypernym: 08508836-n
mero part: 08555400-n
mero part: 08558693-n
mero part: 08571743-n
mero part: 08637195-n