chug-v
type: LexicalEntry
canonical form: chug
sense: 02183816-v
part of speech: verb

02183816-v
type: LexicalConcept
in scheme: en-word.net
definition: make a dull, explosive sound
example: the engine chugged down the street
ili: i32648
lexfile: verb.perception
part of speech: verb
hypernym: 02180712-v

chug-n
type: LexicalEntry
canonical form: chug
sense: 07394452-n
part of speech: noun

07394452-n
type: LexicalConcept
in scheme: en-word.net
definition: the dull explosive noise made by an engine
ili: i75476
lexfile: noun.event
part of speech: noun
hypernym: 07402109-n