chlorambucil-n
type: LexicalEntry
canonical form: chlorambucil
sense: 03025214-n
part of speech: noun

Leukeran-n
type: LexicalEntry
canonical form: Leukeran
sense: 03025214-n
part of speech: noun

03025214-n
type: LexicalConcept
in scheme: en-word.net
definition: an alkylating agent (trade name Leukeran) used to treat some kinds of cancer
ili: i51874
lexfile: noun.artifact
part of speech: noun
hypernym: 02700297-n