cheese-v
type: LexicalEntry
canonical form: cheese
sense: 01525792-v
part of speech: verb
sense: 02686501-v

01525792-v
type: LexicalConcept
in scheme: en-word.net
definition: wind onto a cheese
example: cheese the yarn
ili: i29342
lexfile: verb.contact
part of speech: verb
hypernym: 01525666-v

02686501-v
type: LexicalConcept
in scheme: en-word.net
definition: used in the imperative (get away, or stop it)
example: Cheese it!
ili: i35061
lexfile: verb.stative
part of speech: verb
hypernym: 02686624-v

cheese-n
type: LexicalEntry
canonical form: cheese
sense: 07866305-n
part of speech: noun
sense: 12192020-n

07866305-n
type: LexicalConcept
in scheme: en-word.net
definition: a solid food prepared from the pressed curd of milk
ili: i78427
lexfile: noun.food
part of speech: noun
hypernym: 07859751-n
hypernym: 07571428-n
mero part: 07866933-n
mero substance: 07865888-n

tall mallow-n
type: LexicalEntry
canonical form: tall mallow
sense: 12192020-n
part of speech: noun

high mallow-n
type: LexicalEntry
canonical form: high mallow
sense: 12192020-n
part of speech: noun

cheeseflower-n
type: LexicalEntry
canonical form: cheeseflower
sense: 12192020-n
part of speech: noun

Malva sylvestris-n
type: LexicalEntry
canonical form: Malva sylvestris
sense: 12192020-n
part of speech: noun

12192020-n
type: LexicalConcept
in scheme: en-word.net
definition: erect or decumbent Old World perennial with axillary clusters of rosy-purple flowers; introduced in United States
ili: i101102
lexfile: noun.plant
part of speech: noun
hypernym: 12191102-n