chaperone-v
type: LexicalEntry
canonical form: chaperone
sense: 02030558-v
part of speech: verb

chaperon-v
type: LexicalEntry
canonical form: chaperon
sense: 02030558-v
part of speech: verb

02030558-v
type: LexicalConcept
in scheme: en-word.net
definition: accompany as a chaperone
ili: i31874
lexfile: verb.motion
part of speech: verb
entails: 01130619-v
hypernym: 02029675-v

chaperon-n
type: LexicalEntry
canonical form: chaperon
sense: 09927731-n
part of speech: noun

chaperone-n
type: LexicalEntry
canonical form: chaperone
sense: 09927731-n
part of speech: noun

09927731-n
type: LexicalConcept
in scheme: en-word.net
definition: one who accompanies and supervises a young woman or gatherings of young people
ili: i88913
lexfile: noun.person
part of speech: noun
hypernym: 09637714-n