caress-n
type: LexicalEntry
canonical form: caress
sense: 00145598-n
part of speech: noun

00145598-n
type: LexicalConcept
in scheme: en-word.net
definition: a gentle affectionate stroking (or something resembling it)
example: he showered her with caresses
example: soft music was a fond caress
example: the caresses of the breeze played over his face
ili: i36173
lexfile: noun.act
part of speech: noun
hypernym: 00145452-n

caress-v
type: LexicalEntry
canonical form: caress
sense: 01228779-v
part of speech: verb

fondle-v
type: LexicalEntry
canonical form: fondle
sense: 01228779-v
part of speech: verb

01228779-v
type: LexicalConcept
in scheme: en-word.net
definition: touch or stroke lightly in a loving or endearing manner
example: He caressed her face
example: They fondled in the back seat of the taxi
ili: i27755
lexfile: verb.contact
part of speech: verb
hypernym: 01228534-v