capsulate-a
type: LexicalEntry
canonical form: capsulate
sense: 01661846-s
part of speech: adjective

capsulated-a
type: LexicalEntry
canonical form: capsulated
sense: 01661846-s
part of speech: adjective

01661846-s
type: LexicalConcept
in scheme: en-word.net
definition: used of seeds or spores that are enclosed in a capsule
ili: i9085
lexfile: adj.all
part of speech: adjective satellite
domain topic: 06076105-n
similar: https://en-word.net/synset/01661054-a