Olympia-n
type: LexicalEntry
canonical form: Olympia
sense: 09176763-n
part of speech: noun

capital of Washington-n
type: LexicalEntry
canonical form: capital of Washington
sense: 09176763-n
part of speech: noun

09176763-n
type: LexicalConcept
in scheme: en-word.net
definition: capital of the state of Washington; located in western Washington on Puget Sound
ili: i84740
lexfile: noun.location
part of speech: noun
instance hypernym: 08713353-n