Richmond-n
type: LexicalEntry
canonical form: Richmond
sense: 09172802-n
part of speech: noun

capital of Virginia-n
type: LexicalEntry
canonical form: capital of Virginia
sense: 09172802-n
part of speech: noun

09172802-n
type: LexicalConcept
in scheme: en-word.net
definition: capital of the state of Virginia located in the east central part of the state; was capital of the Confederacy during the American Civil War
ili: i84720
lexfile: noun.location
part of speech: noun
instance hypernym: 08713353-n