Caracas-n
type: LexicalEntry
canonical form: Caracas
sense: 09185069-n
part of speech: noun

capital of Venezuela-n
type: LexicalEntry
canonical form: capital of Venezuela
sense: 09185069-n
part of speech: noun

09185069-n
type: LexicalConcept
in scheme: en-word.net
definition: the capital and largest city of Venezuela
ili: i84783
lexfile: noun.location
part of speech: noun
instance hypernym: 08709407-n