Columbia-n
type: LexicalEntry
canonical form: Columbia
sense: 09161073-n
part of speech: noun

capital of South Carolina-n
type: LexicalEntry
canonical form: capital of South Carolina
sense: 09161073-n
part of speech: noun

09161073-n
type: LexicalConcept
in scheme: en-word.net
definition: capital and largest city in South Carolina; located in central South Carolina
ili: i84657
lexfile: noun.location
part of speech: noun
instance hypernym: 08713353-n