canonic-a
type: LexicalEntry
canonical form: canonic
sense: 01694697-s
part of speech: adjective
sense: 02302973-s
sense: https://en-word.net/lemma/canonic-a#03013035-a
sense: https://en-word.net/lemma/canonic-a#03013161-a

canonical-a
type: LexicalEntry
canonical form: canonical
sense: 01694697-s
part of speech: adjective
sense: 02302973-s
sense: https://en-word.net/lemma/canonical-a#03013035-a
sense: https://en-word.net/lemma/canonical-a#03013161-a

sanctioned-a
type: LexicalEntry
canonical form: sanctioned
sense: 01694697-s
part of speech: adjective

01694697-s
type: LexicalConcept
in scheme: en-word.net
definition: conforming to orthodox or recognized rules
example: the drinking of cocktails was as canonical a rite as the mixing
  source: Sinclair Lewis
ili: i9252
lexfile: adj.all
part of speech: adjective satellite
similar: https://en-word.net/synset/01694333-a

basic-a
type: LexicalEntry
canonical form: basic
sense: 02302973-s
part of speech: adjective

02302973-s
type: LexicalConcept
in scheme: en-word.net
definition: reduced to the simplest and most significant form possible without loss of generality
example: a basic story line
example: a canonical syllable pattern
ili: i12706
lexfile: adj.all
part of speech: adjective satellite
similar: https://en-word.net/synset/02302509-a

https://en-word.net/synset/03013035-a
type: LexicalConcept
in scheme: en-word.net
definition: of or relating to or required by canon law
ili: i17152
lexfile: adj.pert
part of speech: adjective

https://en-word.net/synset/03013161-a
type: LexicalConcept
in scheme: en-word.net
definition: appearing in a biblical canon
example: a canonical book of the Christian New Testament
ili: i17153
lexfile: adj.pert
part of speech: adjective