building material-n
type: LexicalEntry
canonical form: building material
sense: 14810638-n
part of speech: noun

14810638-n
type: LexicalConcept
in scheme: en-word.net
definition: material used for constructing buildings
ili: i114733
lexfile: noun.substance
part of speech: noun
hypernym: 00022119-n