briarroot-n
type: LexicalEntry
canonical form: briarroot
sense: 12248426-n
part of speech: noun

12248426-n
type: LexicalConcept
in scheme: en-word.net
definition: hard woody root of the briar Erica arborea
ili: i101336
lexfile: noun.plant
part of speech: noun
hypernym: 13145876-n
mero substance: 12248562-n