brew-n
type: LexicalEntry
canonical form: brew
sense: 07902547-n
part of speech: noun

brewage-n
type: LexicalEntry
canonical form: brewage
sense: 07902547-n
part of speech: noun

07902547-n
type: LexicalConcept
in scheme: en-word.net
definition: drink made by steeping and boiling and fermenting rather than distilling
ili: i78682
lexfile: noun.food
part of speech: noun
hypernym: 07900542-n