fin-v
type: LexicalEntry
canonical form: fin
sense: 01965517-v
part of speech: verb

break water-v
type: LexicalEntry
canonical form: break water
sense: 01965517-v
part of speech: verb

01965517-v
type: LexicalConcept
in scheme: en-word.net
definition: show the fins above the water while swimming
example: The sharks were finning near the surface
ili: i31536
lexfile: verb.motion
part of speech: verb
hypernym: 01964770-v