till-n
type: LexicalEntry
canonical form: till
sense: 15099339-n
part of speech: noun

boulder clay-n
type: LexicalEntry
canonical form: boulder clay
sense: 15099339-n
part of speech: noun

15099339-n
type: LexicalConcept
in scheme: en-word.net
definition: unstratified soil deposited by a glacier; consists of sand and clay and gravel and boulders mixed together
ili: i116406
lexfile: noun.substance
part of speech: noun
hypernym: 14868863-n