board game-n
type: LexicalEntry
canonical form: board game
sense: 00503426-n
part of speech: noun

00503426-n
type: LexicalConcept
in scheme: en-word.net
definition: a game played on a specially designed board
ili: i38020
lexfile: noun.act
part of speech: noun
hypernym: 00502733-n