bloodbath-n
type: LexicalEntry
canonical form: bloodbath
sense: 00225127-n
part of speech: noun

bloodletting-n
type: LexicalEntry
canonical form: bloodletting
sense: 00225127-n
part of speech: noun
sense: 00699257-n

bloodshed-n
type: LexicalEntry
canonical form: bloodshed
sense: 00225127-n
part of speech: noun

battue-n
type: LexicalEntry
canonical form: battue
sense: 00225127-n
part of speech: noun

00225127-n
type: LexicalConcept
in scheme: en-word.net
definition: indiscriminate slaughter
example: a bloodbath took place when the leaders of the plot surrendered
example: ten days after the bloodletting Hitler gave the action its name
example: the valley is no stranger to bloodshed and murder
example: a huge prison battue was ordered
ili: i36586
lexfile: noun.act
part of speech: noun
hypernym: 00224850-n

00699257-n
type: LexicalConcept
in scheme: en-word.net
definition: formerly used as a treatment to reduce excess blood (one of the four humors of medieval medicine)
ili: i39105
lexfile: noun.act
part of speech: noun
domain topic: 06052606-n
domain topic: 15284095-n
hypernym: 00658847-n