blitz-n
type: LexicalEntry
canonical form: blitz
sense: 00977867-n
part of speech: noun

blitzkrieg-n
type: LexicalEntry
canonical form: blitzkrieg
sense: 00977867-n
part of speech: noun

00977867-n
type: LexicalConcept
in scheme: en-word.net
definition: a swift and violent military offensive with intensive aerial bombardment
ili: i40509
lexfile: noun.act
part of speech: noun
domain topic: 08215965-n
hypernym: 00974725-n

blitzkrieg-v
type: LexicalEntry
canonical form: blitzkrieg
sense: 01095776-v
part of speech: verb

01095776-v
type: LexicalConcept
in scheme: en-word.net
definition: fight a quick and surprising war
ili: i27058
lexfile: verb.competition
part of speech: verb
hypernym: 01095583-v