blitz-n
type: LexicalEntry
canonical form: blitz
sense: 00977867-n
part of speech: noun
sense: 00978171-n

blitzkrieg-n
type: LexicalEntry
canonical form: blitzkrieg
sense: 00977867-n
part of speech: noun

00977867-n
type: LexicalConcept
in scheme: en-word.net
definition: a swift and violent military offensive with intensive aerial bombardment
ili: i40509
lexfile: noun.act
part of speech: noun
domain topic: 08215965-n
hypernym: 00974725-n

safety blitz-n
type: LexicalEntry
canonical form: safety blitz
sense: 00978171-n
part of speech: noun

linebacker blitzing-n
type: LexicalEntry
canonical form: linebacker blitzing
sense: 00978171-n
part of speech: noun

00978171-n
type: LexicalConcept
in scheme: en-word.net
definition: (American football) defensive players try to break through the offensive line
ili: i40511
lexfile: noun.act
part of speech: noun
domain topic: 00470726-n
hypernym: 00557350-n

blitz-v
type: LexicalEntry
canonical form: blitz
sense: 01128645-v
part of speech: verb

01128645-v
type: LexicalConcept
in scheme: en-word.net
definition: attack suddenly and without warning
example: Hitler blitzed Poland
ili: i27233
lexfile: verb.competition
part of speech: verb
hypernym: 01121587-v