blebbed-a
type: LexicalEntry
canonical form: blebbed
sense: 00247204-s
part of speech: adjective

blebby-a
type: LexicalEntry
canonical form: blebby
sense: 00247204-s
part of speech: adjective
sense: 01177982-s

00247204-s
type: LexicalConcept
in scheme: en-word.net
definition: (of glass or quartzite) marred by small bubbles or small particles of foreign material
ili: i1374
lexfile: adj.all
part of speech: adjective satellite
similar: https://en-word.net/synset/00246808-a

blistery-a
type: LexicalEntry
canonical form: blistery
sense: 01177982-s
part of speech: adjective

01177982-s
type: LexicalConcept
in scheme: en-word.net
definition: covered with small blisters
ili: i6418
lexfile: adj.all
part of speech: adjective satellite
similar: https://en-word.net/synset/01176433-a