blackberry-n
type: LexicalEntry
canonical form: blackberry
sense: 12674523-n
part of speech: noun

blackberry bush-n
type: LexicalEntry
canonical form: blackberry bush
sense: 12674523-n
part of speech: noun

12674523-n
type: LexicalConcept
in scheme: en-word.net
definition: bramble with sweet edible black or dark purple berries that usually do not separate from the receptacle
ili: i103368
lexfile: noun.plant
part of speech: noun
hypernym: 12673979-n