bicuspid-a
type: LexicalEntry
canonical form: bicuspid
sense: 02055869-s
part of speech: adjective

bicuspidate-a
type: LexicalEntry
canonical form: bicuspidate
sense: 02055869-s
part of speech: adjective

02055869-s
type: LexicalConcept
in scheme: en-word.net
definition: having two cusps or points (especially a molar tooth)
example: bicuspid teeth
example: bicuspid leaves
ili: i11233
lexfile: adj.all
part of speech: adjective satellite
similar: https://en-word.net/synset/02055227-a

premolar-n
type: LexicalEntry
canonical form: premolar
sense: 05314857-n
part of speech: noun

bicuspid-n
type: LexicalEntry
canonical form: bicuspid
sense: 05314857-n
part of speech: noun

05314857-n
type: LexicalConcept
in scheme: en-word.net
definition: a tooth having two cusps or points; located between the incisors and the molars
ili: i64847
lexfile: noun.body
part of speech: noun
hypernym: 05290245-n